Nowhere Development Status
Current Version: Alpha 91
Release: TBA
Last tweet: 16 days ago
Funding goal: 37%
Founders: 1620

Howdy, Stranger!

It looks like you're new here. If you want to get involved, click one of these buttons!

ERROR:beige.shader

Hi all,
I just backed and downloaded the latest alpha (I'm not sure how to tell what alpha number it is) and tried to run it, but I'm getting an error. I haven't seen this exact error elsewhere in the forum, so I started a new discussion for it.
I'm on windows, so I double clicked nowhere.bat, but it didn't start.

Here's what's in debuglog.txt:

INFO:beige.config:Loading game info from C:\Program Files (x86)\NOWHERE\data\game.json
INFO:beige.config:Loading config from C:\Users\Joshua\AppData\Roaming\duangle\nowhere\settings.json
INFO:liminal.model:Loading C:\Program Files (x86)\NOWHERE\data\main.project...
INFO:liminal.model:Loaded project nowhere
INFO:beige.system:GL Vendor: ATI Technologies Inc.
INFO:beige.system:GL Renderer: ATI Mobility Radeon HD 6370
INFO:beige.system:GL Version: 4.0.10188 Compatibility Profile Context
INFO:beige.system:GL Shadermodel: 4.00
INFO:beige.system:GL Context Major Version: 2
INFO:beige.system:GL Context Minor Version: 1
INFO:beige.system:GL_MAJOR_VERSION: 4
INFO:beige.system:GL_MINOR_VERSION: 0
INFO:beige.system:MAX_DRAW_BUFFERS: 8
INFO:beige.system:MAX_ELEMENTS_INDICES: 16777215
INFO:beige.system:MAX_ELEMENTS_VERTICES: 2147483647
INFO:beige.system:MAX_COLOR_TEXTURE_SAMPLES: 4
INFO:beige.system:MAX_DEPTH_TEXTURE_SAMPLES: 4
INFO:beige.system:MAX_TEXTURE_IMAGE_UNITS: 16
INFO:beige.system:MAX_TEXTURE_SIZE: 16384
INFO:beige.system:MAX_RECTANGLE_TEXTURE_SIZE: 16384
INFO:beige.system:MAX_3D_TEXTURE_SIZE: 8192
INFO:beige.system:MAX_UNIFORM_BUFFER_BINDINGS: 75
INFO:beige.system:MAX_COMBINED_TEXTURE_IMAGE_UNITS: 32
INFO:beige.system:Initializing SDL subsystem...
INFO:beige.system:Setting GL context version to 3.2
INFO:beige.system:Creating window (1600x900 x:0 y:0)
INFO:beige.system:Video Quality: 4
INFO:beige.system:Creating context...
INFO:beige.system:GL Vendor: ATI Technologies Inc.
INFO:beige.system:GL Renderer: ATI Mobility Radeon HD 6370
INFO:beige.system:GL Version: 3.2.10188 Core Profile Context
INFO:beige.system:GL Shadermodel: 4.00
INFO:beige.system:GL Context Major Version: 3
INFO:beige.system:GL Context Minor Version: 2
INFO:beige.system:GL_MAJOR_VERSION: 3
INFO:beige.system:GL_MINOR_VERSION: 2
INFO:beige.system:MAX_DRAW_BUFFERS: 8
INFO:beige.system:MAX_ELEMENTS_INDICES: 16777215
INFO:beige.system:MAX_ELEMENTS_VERTICES: 2147483647
INFO:beige.system:MAX_COLOR_TEXTURE_SAMPLES: 4
INFO:beige.system:MAX_DEPTH_TEXTURE_SAMPLES: 4
INFO:beige.system:MAX_TEXTURE_IMAGE_UNITS: 16
INFO:beige.system:MAX_TEXTURE_SIZE: 16384
INFO:beige.system:MAX_RECTANGLE_TEXTURE_SIZE: 16384
INFO:beige.system:MAX_3D_TEXTURE_SIZE: 8192
INFO:beige.system:MAX_UNIFORM_BUFFER_BINDINGS: 75
INFO:beige.system:MAX_COMBINED_TEXTURE_IMAGE_UNITS: 32
INFO:beige.system:0 controller(s) connected.
ERROR:beige.shader:Compilation of program for ppfx/fxaa3_11 FAILED:
ERROR:beige.shader:Fragment shader(s) failed to link, vertex shader(s) failed to link.
ERROR:beige.shader:unexpected error.
ERROR:beige.shader:unexpected error.
ERROR:beige.shader:
WARNING:beige.shader:shader has no program

Also, the console included a stack trace that wasn't included in the debuglog, so I've included it here:

ERROR:beige.shader:Compilation of program for ppfx/fxaa3_11 FAILED:
ERROR:beige.shader:Fragment shader(s) failed to link, vertex shader(s) failed t
o link.
ERROR:beige.shader:unexpected error.
ERROR:beige.shader:unexpected error.
ERROR:beige.shader:
Traceback (most recent call last):
File "C:\Program Files (x86)\NOWHERE\lib\runpy.py", line 162, in _run_module_a
s_main
"main", fname, loader, pkg_name)
File "C:\Program Files (x86)\NOWHERE\lib\runpy.py", line 72, in _run_code
exec code in run_globals
File "C:\Program Files (x86)\NOWHERE\nowhere.py", line 47, in
main()
File "C:\Program Files (x86)\NOWHERE\nowhere.py", line 44, in main
rt.run()
File "C:\Program Files (x86)\NOWHERE\lib\site-packages\beige-0.1-py2.7-win32.e
gg\beige\liminal__main__.py", line 109, in run
System().run()
File "C:\Program Files (x86)\NOWHERE\lib\site-packages\beige-0.1-py2.7-win32.e
gg\beige\engine\system.py", line 679, in run
RenderManager().init()
File "C:\Program Files (x86)\NOWHERE\lib\site-packages\beige-0.1-py2.7-win32.e
gg\beige\engine\core.py", line 97, in init
self.init_viewport()
File "C:\Program Files (x86)\NOWHERE\lib\site-packages\beige-0.1-py2.7-win32.e
gg\beige\engine\core.py", line 214, in init_viewport
self._add_default_ppfx()
File "C:\Program Files (x86)\NOWHERE\lib\site-packages\beige-0.1-py2.7-win32.e
gg\beige\engine\core.py", line 200, in _add_default_ppfx
ppfx = PPFX.from_shader_files('ppfx/fxaa3_11')
File "C:\Program Files (x86)\NOWHERE\lib\site-packages\beige-0.1-py2.7-win32.e
gg\beige\engine\ppfx.py", line 170, in from_shader_files
ppfx = cls(shader)
File "C:\Program Files (x86)\NOWHERE\lib\site-packages\beige-0.1-py2.7-win32.e
gg\beige\engine\ppfx.py", line 142, in init
material = Material(shader)
File "C:\Program Files (x86)\NOWHERE\lib\site-packages\beige-0.1-py2.7-win32.e
gg\beige\engine\material.py", line 73, in init
self._uniforms = shader.active_uniforms.new_struct()
AttributeError: 'NoneType' object has no attribute 'new_struct'
Press any key to continue . . .

Any ideas of what I should try next would be appreciated; I'm excited for this game and want to help however I can!
Thanks. :-)

Comments

Sign In or Register to comment.